Target
Adenosine receptor A1
Ligand
BDBM50006700
Substrate
Meas. Tech.
ChEBML_29291
Ki
>100000±n/a nM
Citation
 Shimada, JSuzuki, FNonaka, HIshii, AIchikawa, S (E)-1,3-dialkyl-7-methyl-8-(3,4,5-trimethoxystyryl)xanthines: potent and selective adenosine A2 antagonists. J Med Chem 35:2342-5 (1992)  
Target
Name:
Adenosine receptor A1
Synonyms:
A1 adenosine receptor ADENOSINE A1 ADENOSINE A1 low Adenosine A1 receptor | Adenosine Receptor A1
Type:
Enzyme Catalytic Domain
Mol. Mass.:
36501.39
Organism:
GUINEA PIG
Description:
ADENOSINE A1 ADORA1 GUINEA PIG::P47745
Residue:
326
  
Inhibitor
Name:
BDBM50006700
Synonyms:
8-[2-(4-Methoxy-phenyl)-vinyl]-1,3-dipropyl-3,7-dihydro-purine-2,6-dione | CHEMBL77323
Type:
Small organic molecule
Emp. Form.:
C20H24N4O3
Mol. Mass.:
368.4296
SMILES:
CCCn1c2nc(C=Cc3ccc(OC)cc3)[nH]c2c(=O)n(CCC)c1=O
: