Target
Adenosine receptor A2a/A2b
Ligand
BDBM50006710
Substrate
Meas. Tech.
ChEMBL_27939 (CHEMBL649120)
Ki
7.8±n/a nM
Citation
 Shimada, JSuzuki, FNonaka, HIshii, AIchikawa, S (E)-1,3-dialkyl-7-methyl-8-(3,4,5-trimethoxystyryl)xanthines: potent and selective adenosine A2 antagonists. J Med Chem 35:2342-5 (1992)  
Target
Name:
Adenosine receptor A2a/A2b
Synonyms:
Adenosine A2 receptor
Type:
Mol. Mass.:
Description:
ASSAY_ID of ChEMBL is 30560
Components:
This complex has 2 components.
Component 1
Name:
Adenosine receptor A2b
Synonyms:
AA2BR_RAT Adora2b
Type:
PROTEIN
Mol. Mass.:
36378.84
Organism:
Rattus norvegicus
Description:
ChEMBL_32934
Residue:
332
  
Component 2
Name:
Adenosine receptor A2a
Synonyms:
AA2AR_RAT Adenosine A2 receptor Adenosine Receptors A2a (A2a) Adenosine receptors A2a Rat striatal adenosine A2a receptor
Type:
G Protein-Coupled Receptor (GPCR)
Mol. Mass.:
45015.65
Organism:
Rattus norvegicus (rat)
Description:
Rat A2A receptors expressed in CHO cells.
Residue:
410
  
Inhibitor
Name:
BDBM50006710
Synonyms:
8-[(E)-2-(3,4-Dimethoxy-phenyl)-vinyl]-7-methyl-1,3-dipropyl-3,7-dihydro-purine-2,6-dione 8-[2-(3,4-Dimethoxy-phenyl)-vinyl]-7-methyl-1,3-dipropyl-3,7-dihydro-purine-2,6-dione; compound with 8-[2-(3,4-dimethoxy-phenyl)-vinyl]-7-methyl-1,3-dipropyl-3,7-dihydro-purine-2,6-dione CHEMBL27508 | KF-17837
Type:
Small organic molecule
Emp. Form.:
C22H28N4O4
Mol. Mass.:
412.4821
SMILES:
CCCn1c2nc(\C=C\c3ccc(OC)c(OC)c3)n(C)c2c(=O)n(CCC)c1=O
: