Target
Gag-Pol polyprotein [489-587]
Ligand
BDBM50406676
Substrate
Meas. Tech.
ChEMBL_159303 (CHEMBL769356)
IC50
8600±n/a nM
Citation
 Tucker, TJLumma, WCPayne, LSWai, JMde Solms, SJGiuliani, EADarke, PLHeimbach, JCZugay, JASchleif, WA A series of potent HIV-1 protease inhibitors containing a hydroxyethyl secondary amine transition state isostere: synthesis, enzyme inhibition, and antiviral activity. J Med Chem 35:2525-33 (1992)  
Target
Name:
Gag-Pol polyprotein [489-587]
Synonyms:
Human immunodeficiency virus type 1 protease Pol polyprotein | gag-pol
Type:
Enzyme Subunit
Mol. Mass.:
10781.16
Organism:
Human immunodeficiency virus type 1
Description:
P04585[489-587]
Residue:
99
  
Inhibitor
Name:
BDBM50406676
Synonyms:
CHEMBL2115206
Type:
Small organic molecule
Emp. Form.:
C33H41N3O6
Mol. Mass.:
575.6951
SMILES:
CC(C)(C)OC(=O)N[C@@H](Cc1ccccc1)[C@H](O)CNC(C(O)c1ccccc1)C(=O)N[C@@H]1[C@H](O)Cc2ccccc12
: