Target
Gag-Pol polyprotein [489-587]
Ligand
BDBM50006835
Substrate
Meas. Tech.
ChEMBL_159304 (CHEMBL769357)
IC50
63000±n/a nM
Citation
 Tucker, TJLumma, WCPayne, LSWai, JMde Solms, SJGiuliani, EADarke, PLHeimbach, JCZugay, JASchleif, WA A series of potent HIV-1 protease inhibitors containing a hydroxyethyl secondary amine transition state isostere: synthesis, enzyme inhibition, and antiviral activity. J Med Chem 35:2525-33 (1992)  
Target
Name:
Gag-Pol polyprotein [489-587]
Synonyms:
Human immunodeficiency virus type 1 protease Pol polyprotein | gag-pol
Type:
Enzyme Subunit
Mol. Mass.:
10781.16
Organism:
Human immunodeficiency virus type 1
Description:
P04585[489-587]
Residue:
99
  
Inhibitor
Name:
BDBM50006835
Synonyms:
2-(3-Amino-2-hydroxy-4-phenyl-butylamino)-N-(2-hydroxy-indan-1-yl)-3-phenyl-propionamide (0.25 hydrate) | CHEMBL313367
Type:
Small organic molecule
Emp. Form.:
C28H33N3O3
Mol. Mass.:
459.5799
SMILES:
N[C@@H](Cc1ccccc1)C(O)CN[C@@H](Cc1ccccc1)C(=O)NC1[C@H](O)Cc2ccccc12
: