Target
Alpha-1A adrenergic receptor
Ligand
BDBM50006953
Substrate
Meas. Tech.
ChEMBL_33276 (CHEMBL643614)
Ki
0.32±n/a nM
Citation
 Russo, FRomeo, GGuccione, SDe Blasi, A Pyrimido[5,4-b]indole derivatives. 1. A new class of potent and selective alpha 1 adrenoceptor ligands. J Med Chem 34:1850-4 (1991)  
Target
Name:
Alpha-1A adrenergic receptor
Synonyms:
ADA1A_RAT Adra1c Alpha-1A adrenoceptor Alpha-1C adrenergic receptor | adrenergic Alpha1A
Type:
Protein
Mol. Mass.:
51620.15
Organism:
Rattus norvegicus (Rat)
Description:
P43140
Residue:
466
  
Inhibitor
Name:
BDBM50006953
Synonyms:
2-{2-[4-(2-Methoxy-phenyl)-piperazin-1-yl]-ethyl}-4,9-dimethyl-4,9-dihydro-2,4,9-triaza-fluorene-1,3-dione | CHEMBL54716
Type:
Small organic molecule
Emp. Form.:
C25H29N5O3
Mol. Mass.:
447.5295
SMILES:
COc1ccccc1N1CCN(CCn2c(=O)n(C)c3c4ccccc4n(C)c3c2=O)CC1
: