Target
Alpha-1A adrenergic receptor
Ligand
BDBM50006959
Substrate
Meas. Tech.
ChEMBL_33277 (CHEMBL644237)
Ki
>100000±n/a nM
Citation
 Russo, FRomeo, GGuccione, SDe Blasi, A Pyrimido[5,4-b]indole derivatives. 1. A new class of potent and selective alpha 1 adrenoceptor ligands. J Med Chem 34:1850-4 (1991)  
Target
Name:
Alpha-1A adrenergic receptor
Synonyms:
ADA1A_RAT Adra1c Alpha-1A adrenoceptor Alpha-1C adrenergic receptor | adrenergic Alpha1A
Type:
Protein
Mol. Mass.:
51620.15
Organism:
Rattus norvegicus (Rat)
Description:
P43140
Residue:
466
  
Inhibitor
Name:
BDBM50006959
Synonyms:
4-[2-(1,3-Dioxo-1,3,4,9-tetrahydro-2,4,9-triaza-fluoren-2-yl)-ethyl]-piperazine-1-carboxylic acid ethyl ester | CHEMBL55456
Type:
Small organic molecule
Emp. Form.:
C19H23N5O4
Mol. Mass.:
385.417
SMILES:
CCOC(=O)N1CCN(CCn2c(=O)[nH]c3c4ccccc4[nH]c3c2=O)CC1
: