Target
Alpha-1A adrenergic receptor
Ligand
BDBM50006960
Substrate
Meas. Tech.
ChEMBL_33277 (CHEMBL644237)
Ki
>100000±n/a nM
Citation
 Russo, FRomeo, GGuccione, SDe Blasi, A Pyrimido[5,4-b]indole derivatives. 1. A new class of potent and selective alpha 1 adrenoceptor ligands. J Med Chem 34:1850-4 (1991)  
Target
Name:
Alpha-1A adrenergic receptor
Synonyms:
ADA1A_RAT Adra1c Alpha-1A adrenoceptor Alpha-1C adrenergic receptor | adrenergic Alpha1A
Type:
Protein
Mol. Mass.:
51620.15
Organism:
Rattus norvegicus (Rat)
Description:
P43140
Residue:
466
  
Inhibitor
Name:
BDBM50006960
Synonyms:
2-(2-Diethylamino-ethyl)-4,9-dihydro-2,4,9-triaza-fluorene-1,3-dione | CHEMBL439745
Type:
Small organic molecule
Emp. Form.:
C16H20N4O2
Mol. Mass.:
300.3556
SMILES:
CCN(CC)CCn1c(=O)[nH]c2c3ccccc3[nH]c2c1=O
: