Target
5-hydroxytryptamine receptor 1A
Ligand
BDBM50006953
Substrate
Meas. Tech.
ChEMBL_1133 (CHEMBL616078)
Ki
1.5±n/a nM
Citation
 Russo, FRomeo, GGuccione, SDe Blasi, A Pyrimido[5,4-b]indole derivatives. 1. A new class of potent and selective alpha 1 adrenoceptor ligands. J Med Chem 34:1850-4 (1991)  
Target
Name:
5-hydroxytryptamine receptor 1A
Synonyms:
5-HT-1A 5-HT1A 5-hydroxytryptamine receptor 1A (5HT1A) 5ht1a Htr1a Serotonin 1a (5-HT1a) receptor/Adrenergic receptor alpha-1 | Serotonin receptor 1A
Type:
G Protein-Coupled Receptor (GPCR)
Mol. Mass.:
46445.29
Organism:
Rattus norvegicus (rat)
Description:
Binding assays were performed using rat hippocampal membranes.
Residue:
422
  
Inhibitor
Name:
BDBM50006953
Synonyms:
2-{2-[4-(2-Methoxy-phenyl)-piperazin-1-yl]-ethyl}-4,9-dimethyl-4,9-dihydro-2,4,9-triaza-fluorene-1,3-dione | CHEMBL54716
Type:
Small organic molecule
Emp. Form.:
C25H29N5O3
Mol. Mass.:
447.5295
SMILES:
COc1ccccc1N1CCN(CCn2c(=O)n(C)c3c4ccccc4n(C)c3c2=O)CC1
: