Target
Sigma non-opioid intracellular receptor 1
Ligand
BDBM50006993
Substrate
Meas. Tech.
ChEMBL_201262 (CHEMBL804880)
IC50
8±n/a nM
Citation
 Wilson, AADannals, RFRavert, HTSonders, MSWeber, EWagner, HN Radiosynthesis of sigma receptor ligands for positron emission tomography: 11C- and 18F-labeled guanidines. J Med Chem 34:1867-70 (1991)  
Target
Name:
Sigma non-opioid intracellular receptor 1
Synonyms:
Aging-associated gene 8 protein SGMR1_HUMAN SIGMAR1 SR31747-binding protein Sigma 1-type opioid receptor Sigma1R | hSigmaR1
Type:
Enzyme Catalytic Domain
Mol. Mass.:
25124.85
Organism:
Homo sapiens (Human)
Description:
Q99720
Residue:
223
  
Inhibitor
Name:
BDBM50006993
Synonyms:
CHEMBL293059 | N-Adamantan-1-yl-N'-(2-fluoro-phenyl)-guanidine
Type:
Small organic molecule
Emp. Form.:
C17H22FN3
Mol. Mass.:
287.3751
SMILES:
NC(NC12CC3CC(CC(C3)C1)C2)=Nc1ccccc1F
: