Target
Polyunsaturated fatty acid 5-lipoxygenase
Ligand
BDBM50007040
Substrate
Meas. Tech.
ChEMBL_3862 (CHEMBL618766)
IC50
<30±n/a nM
Citation
 Bird, naBruneau, PCrawley, GCEdwards, MPFoster, SJGirodeau, JMKingston, JFMcMillan, RM (Methoxyalkyl)thiazoles: a new series of potent, selective, and orally active 5-lipoxygenase inhibitors displaying high enantioselectivity. J Med Chem 34:2176-86 (1991)  
Target
Name:
Polyunsaturated fatty acid 5-lipoxygenase
Synonyms:
5-LO Alox5 LOX5_MOUSE
Type:
PROTEIN
Mol. Mass.:
77961.27
Organism:
Mus musculus
Description:
ChEMBL_675639
Residue:
674
  
Inhibitor
Name:
BDBM50007040
Synonyms:
2-[1-Methoxy-6-(naphthalen-2-ylmethoxy)-indan-1-yl]-thiazole | CHEMBL20953
Type:
Small organic molecule
Emp. Form.:
C24H21NO2S
Mol. Mass.:
387.494
SMILES:
COC1(CCc2ccc(OCc3ccc4ccccc4c3)cc12)c1nccs1
: