Target
Polyunsaturated fatty acid 5-lipoxygenase
Ligand
BDBM50007057
Substrate
Meas. Tech.
ChEBML_3863
IC50
30±n/a nM
Citation
 Bird, naBruneau, PCrawley, GCEdwards, MPFoster, SJGirodeau, JMKingston, JFMcMillan, RM (Methoxyalkyl)thiazoles: a new series of potent, selective, and orally active 5-lipoxygenase inhibitors displaying high enantioselectivity. J Med Chem 34:2176-86 (1991)  
Target
Name:
Polyunsaturated fatty acid 5-lipoxygenase
Synonyms:
5-LO Alox5 LOX5_MOUSE
Type:
PROTEIN
Mol. Mass.:
77961.27
Organism:
Mus musculus
Description:
ChEMBL_675639
Residue:
674
  
Inhibitor
Name:
BDBM50007057
Synonyms:
1-[3-(3-Phenyl-prop-2-ynyloxy)-phenyl]-1-thiazol-2-yl-propan-1-ol | CHEMBL71775
Type:
Small organic molecule
Emp. Form.:
C21H19NO2S
Mol. Mass.:
349.446
SMILES:
CCC(O)(c1nccs1)c1cccc(OCC#Cc2ccccc2)c1
: