Target
Polyunsaturated fatty acid 5-lipoxygenase
Ligand
BDBM50007053
Substrate
Meas. Tech.
ChEBML_3917
IC50
30000±n/a nM
Citation
 Bird, naBruneau, PCrawley, GCEdwards, MPFoster, SJGirodeau, JMKingston, JFMcMillan, RM (Methoxyalkyl)thiazoles: a new series of potent, selective, and orally active 5-lipoxygenase inhibitors displaying high enantioselectivity. J Med Chem 34:2176-86 (1991)  
Target
Name:
Polyunsaturated fatty acid 5-lipoxygenase
Synonyms:
Alox5 LOX5_RAT
Type:
PROTEIN
Mol. Mass.:
78082.31
Organism:
Rattus norvegicus
Description:
ChEMBL_1432947
Residue:
673
  
Inhibitor
Name:
BDBM50007053
Synonyms:
CHEMBL73720 | [3-(Naphthalen-2-ylmethoxy)-phenyl]-thiazol-2-yl-methanol
Type:
Small organic molecule
Emp. Form.:
C21H17NO2S
Mol. Mass.:
347.43
SMILES:
OC(c1nccs1)c1cccc(OCc2ccc3ccccc3c2)c1
: