Target
5-hydroxytryptamine receptor 2C
Ligand
BDBM50007129
Substrate
Meas. Tech.
ChEBML_1857
Ki
>10000±n/a nM
Citation
 DeNinno, MPSchoenleber, RPerner, RJLijewski, LAsin, KEBritton, DRMacKenzie, RKebabian, JW Synthesis and dopaminergic activity of 3-substituted 1-(aminomethyl)-3,4-dihydro-5,6-dihydroxy-1H-2-benzopyrans: characterization of an auxiliary binding region in the D1 receptor. J Med Chem 34:2561-9 (1991)  
Target
Name:
5-hydroxytryptamine receptor 2C
Synonyms:
5-HT2C 5-hydroxytryptamine receptor 2C (5HT2c) 5ht1c Htr2c Serotonin receptor 2a and 2c (5HT2A and 5HT2C)
Type:
Enzyme
Mol. Mass.:
51935.10
Organism:
Rattus norvegicus (Rat)
Description:
P08909
Residue:
460
  
Inhibitor
Name:
BDBM50007129
Synonyms:
(1R,3S)-1-Aminomethyl-3-phenyl-isochroman-5,6-diol A-70108 | CHEMBL86931
Type:
Small organic molecule
Emp. Form.:
C16H17NO3
Mol. Mass.:
271.3111
SMILES:
NC[C@@H]1O[C@@H](Cc2c(O)c(O)ccc12)c1ccccc1
: