Target
D(1A) dopamine receptor
Ligand
BDBM50007144
Substrate
Meas. Tech.
ChEBML_60188
EC50
13±n/a nM
Citation
 DeNinno, MPSchoenleber, RPerner, RJLijewski, LAsin, KEBritton, DRMacKenzie, RKebabian, JW Synthesis and dopaminergic activity of 3-substituted 1-(aminomethyl)-3,4-dihydro-5,6-dihydroxy-1H-2-benzopyrans: characterization of an auxiliary binding region in the D1 receptor. J Med Chem 34:2561-9 (1991)  
Target
Name:
D(1A) dopamine receptor
Synonyms:
DA D1 receptor DRD1 Dopamine D1 receptor Dopamine D1A
Type:
Enzyme
Mol. Mass.:
49303.43
Organism:
Homo sapiens (Human)
Description:
P21728
Residue:
446
  
Inhibitor
Name:
BDBM50007144
Synonyms:
3-Cyclohexyl-1-prop-2-ynylaminomethyl-isochroman-5,6-diol | CHEMBL420788
Type:
Small organic molecule
Emp. Form.:
C19H25NO3
Mol. Mass.:
315.4067
SMILES:
Oc1ccc2[C@H](CNCC#C)OC(Cc2c1O)C1CCCCC1
: