Target
D(1A) dopamine receptor
Ligand
BDBM50007151
Substrate
Meas. Tech.
ChEBML_60521
Ki
407±n/a nM
Citation
 DeNinno, MPSchoenleber, RPerner, RJLijewski, LAsin, KEBritton, DRMacKenzie, RKebabian, JW Synthesis and dopaminergic activity of 3-substituted 1-(aminomethyl)-3,4-dihydro-5,6-dihydroxy-1H-2-benzopyrans: characterization of an auxiliary binding region in the D1 receptor. J Med Chem 34:2561-9 (1991)  
Target
Name:
D(1A) dopamine receptor
Synonyms:
DOPAMINE D1 Dopamine D1 high Dopamine receptor Dopamine1-like Drd1a
Type:
Enzyme Catalytic Domain
Mol. Mass.:
49429.75
Organism:
RAT
Description:
P18901
Residue:
446
  
Inhibitor
Name:
BDBM50007151
Synonyms:
1-Aminomethyl-3-prop-2-ynyl-isochroman-5,6-diol | CHEMBL315849
Type:
Small organic molecule
Emp. Form.:
C13H15NO3
Mol. Mass.:
233.2631
SMILES:
NC[C@@H]1OC(CC#C)Cc2c(O)c(O)ccc12
: