Target
D(2) dopamine receptor
Ligand
BDBM50007130
Substrate
Meas. Tech.
ChEBML_58366
EC50
>10000±n/a nM
Citation
 DeNinno, MPSchoenleber, RPerner, RJLijewski, LAsin, KEBritton, DRMacKenzie, RKebabian, JW Synthesis and dopaminergic activity of 3-substituted 1-(aminomethyl)-3,4-dihydro-5,6-dihydroxy-1H-2-benzopyrans: characterization of an auxiliary binding region in the D1 receptor. J Med Chem 34:2561-9 (1991)  
Target
Name:
D(2) dopamine receptor
Synonyms:
DOPAMINE D2 DOPAMINE D2 Short Dopamine D2 receptor Drd2
Type:
G Protein-Coupled Receptor (GPCR)
Mol. Mass.:
50931.60
Organism:
Rattus norvegicus (rat)
Description:
P61169
Residue:
444
  
Inhibitor
Name:
BDBM50007130
Synonyms:
1-Aminomethyl-3-phenoxymethyl-isochroman-5,6-diol | CHEMBL86576
Type:
Small organic molecule
Emp. Form.:
C17H19NO4
Mol. Mass.:
301.3371
SMILES:
NC[C@@H]1OC(COc2ccccc2)Cc2c(O)c(O)ccc12
: