Target
D(2) dopamine receptor
Ligand
BDBM50007147
Substrate
Meas. Tech.
ChEMBL_62257 (CHEMBL675484)
Ki
1290±n/a nM
Citation
 DeNinno, MPSchoenleber, RPerner, RJLijewski, LAsin, KEBritton, DRMacKenzie, RKebabian, JW Synthesis and dopaminergic activity of 3-substituted 1-(aminomethyl)-3,4-dihydro-5,6-dihydroxy-1H-2-benzopyrans: characterization of an auxiliary binding region in the D1 receptor. J Med Chem 34:2561-9 (1991)  
Target
Name:
D(2) dopamine receptor
Synonyms:
DOPAMINE D2 DOPAMINE D2 Short Dopamine D2 receptor Drd2
Type:
G Protein-Coupled Receptor (GPCR)
Mol. Mass.:
50931.60
Organism:
Rattus norvegicus (rat)
Description:
P61169
Residue:
444
  
Inhibitor
Name:
BDBM50007147
Synonyms:
3-Adamantan-1-yl-1-aminomethyl-isochroman-5,6-diol | CHEMBL313530
Type:
Small organic molecule
Emp. Form.:
C20H27NO3
Mol. Mass.:
329.4333
SMILES:
NC[C@@H]1OC(Cc2c(O)c(O)ccc12)C12C[C@H]3C[C@H](C[C@H](C3)C1)C2
: