Target
Mu-type opioid receptor
Ligand
BDBM50000296
Substrate
Meas. Tech.
ChEBML_146256
Ki
616±n/a nM
Citation
 Vecchietti, VClarke, GDColle, RGiardina, GPetrone, GSbacchi, M (1S)-1-(aminomethyl)-2-(arylacetyl)-1,2,3,4-tetrahydroisoquinoline and heterocycle-condensed tetrahydropyridine derivatives: members of a novel class of very potent kappa opioid analgesics. J Med Chem 34:2624-33 (1991)  
Target
Name:
Mu-type opioid receptor
Synonyms:
M-OR-1 Mu opioid receptor OPIATE Mu OPRM_CAVPO
Type:
Enzyme Catalytic Domain
Mol. Mass.:
11165.58
Organism:
GUINEA PIG
Description:
P97266
Residue:
98
  
Inhibitor
Name:
BDBM50000296
Synonyms:
CHEMBL441765 U-50488H | US11492374, ID 1
Type:
Small organic molecule
Emp. Form.:
C19H26Cl2N2O
Mol. Mass.:
369.329
SMILES:
CN([C@@H]1CCCC[C@H]1N1CCCC1)C(=O)Cc1ccc(Cl)c(Cl)c1
: