Target
Mu-type opioid receptor
Ligand
BDBM50001108
Substrate
Meas. Tech.
ChEBML_146256
Ki
30±n/a nM
Citation
 Vecchietti, VClarke, GDColle, RGiardina, GPetrone, GSbacchi, M (1S)-1-(aminomethyl)-2-(arylacetyl)-1,2,3,4-tetrahydroisoquinoline and heterocycle-condensed tetrahydropyridine derivatives: members of a novel class of very potent kappa opioid analgesics. J Med Chem 34:2624-33 (1991)  
Target
Name:
Mu-type opioid receptor
Synonyms:
M-OR-1 Mu opioid receptor OPIATE Mu OPRM_CAVPO
Type:
Enzyme Catalytic Domain
Mol. Mass.:
11165.58
Organism:
GUINEA PIG
Description:
P97266
Residue:
98
  
Inhibitor
Name:
BDBM50001108
Synonyms:
2-(3,4-Dichloro-phenyl)-1-(1-pyrrolidin-1-ylmethyl-3,4-dihydro-1H-isoquinolin-2-yl)-ethanone 2-(3,4-Dichloro-phenyl)-1-(1-pyrrolidin-1-ylmethyl-3,4-dihydro-1H-isoquinolin-2-yl)-ethanone;HCl | CHEMBL275025
Type:
Small organic molecule
Emp. Form.:
C22H24Cl2N2O
Mol. Mass.:
403.345
SMILES:
Clc1ccc(CC(=O)N2CCc3ccccc3C2CN2CCCC2)cc1Cl
: