Target
Delta-type opioid receptor
Ligand
BDBM50007162
Substrate
Meas. Tech.
ChEMBL_146437 (CHEMBL757334)
Ki
>1000±n/a nM
Citation
 Vecchietti, VClarke, GDColle, RGiardina, GPetrone, GSbacchi, M (1S)-1-(aminomethyl)-2-(arylacetyl)-1,2,3,4-tetrahydroisoquinoline and heterocycle-condensed tetrahydropyridine derivatives: members of a novel class of very potent kappa opioid analgesics. J Med Chem 34:2624-33 (1991)  
Target
Name:
Delta-type opioid receptor
Synonyms:
D-OR-1 Delta opioid receptor OPIATE Delta OPRD1 OPRK1 | opioid receptor, delta 1
Type:
G Protein-Coupled Receptor (GPCR)
Mol. Mass.:
40382.98
Organism:
Homo sapiens (Human)
Description:
Competition binding assays were carried out using membrane preparations from transfected HN9.10 cells that constitutively expressed the delta opioid receptor.
Residue:
372
  
Inhibitor
Name:
BDBM50007162
Synonyms:
2-(3,4-Dichloro-phenyl)-1-(1-pyrrolidin-1-ylmethyl-1,3,4,9-tetrahydro-beta-carbolin-2-yl)-ethanone;HCl | CHEMBL329343
Type:
Small organic molecule
Emp. Form.:
C24H25Cl2N3O
Mol. Mass.:
442.381
SMILES:
Clc1ccc(CC(=O)N2CCc3c([nH]c4ccccc34)C2CN2CCCC2)cc1Cl
: