Target
Delta-type opioid receptor
Ligand
BDBM50007164
Substrate
Meas. Tech.
ChEMBL_146437 (CHEMBL757334)
Ki
1000±n/a nM
Citation
 Vecchietti, VClarke, GDColle, RGiardina, GPetrone, GSbacchi, M (1S)-1-(aminomethyl)-2-(arylacetyl)-1,2,3,4-tetrahydroisoquinoline and heterocycle-condensed tetrahydropyridine derivatives: members of a novel class of very potent kappa opioid analgesics. J Med Chem 34:2624-33 (1991)  
Target
Name:
Delta-type opioid receptor
Synonyms:
D-OR-1 Delta opioid receptor OPIATE Delta OPRD1 OPRK1 | opioid receptor, delta 1
Type:
G Protein-Coupled Receptor (GPCR)
Mol. Mass.:
40382.98
Organism:
Homo sapiens (Human)
Description:
Competition binding assays were carried out using membrane preparations from transfected HN9.10 cells that constitutively expressed the delta opioid receptor.
Residue:
372
  
Inhibitor
Name:
BDBM50007164
Synonyms:
(S)-1-(2-Pyrrolidin-1-ylmethyl-piperidin-1-yl)-2-(4-trifluoromethyl-phenyl)-ethanone(BRL 52656) 1-(2-Pyrrolidin-1-ylmethyl-piperidin-1-yl)-2-(4-trifluoromethyl-phenyl)-ethanone CHEMBL433508
Type:
Small organic molecule
Emp. Form.:
C19H25F3N2O
Mol. Mass.:
354.4098
SMILES:
FC(F)(F)c1ccc(CC(=O)N2CCCC[C@H]2CN2CCCC2)cc1
: