Target
5-hydroxytryptamine receptor 1A
Ligand
BDBM50007178
Substrate
Meas. Tech.
ChEBML_1117
Ki
1000±n/a nM
Citation
 Raghupathi, RKRydelek-Fitzgerald, LTeitler, MGlennon, RA Analogues of the 5-HT1A serotonin antagonist 1-(2-methoxyphenyl)-4-[4-(2-phthalimido)butyl]piperazine with reduced alpha 1-adrenergic affinity. J Med Chem 34:2633-8 (1991)  
Target
Name:
5-hydroxytryptamine receptor 1A
Synonyms:
5-HT-1A 5-HT1A 5-hydroxytryptamine receptor 1A (5HT1A) 5ht1a Htr1a Serotonin 1a (5-HT1a) receptor/Adrenergic receptor alpha-1 | Serotonin receptor 1A
Type:
G Protein-Coupled Receptor (GPCR)
Mol. Mass.:
46445.29
Organism:
Rattus norvegicus (rat)
Description:
Binding assays were performed using rat hippocampal membranes.
Residue:
422
  
Inhibitor
Name:
BDBM50007178
Synonyms:
2-{4-[4-(4-Nitro-phenyl)-piperazin-1-yl]-butyl}-isoindole-1,3-dione | CHEMBL26030
Type:
Small organic molecule
Emp. Form.:
C22H24N4O4
Mol. Mass.:
408.4504
SMILES:
[O-][N+](=O)c1ccc(cc1)N1CCN(CCCCN2C(=O)c3ccccc3C2=O)CC1
: