Target
Sigma non-opioid intracellular receptor 1
Ligand
BDBM50007315
Substrate
Meas. Tech.
ChEBML_201279
Ki
3.1±n/a nM
Citation
 Radesca, LBowen, WDDi Paolo, Lde Costa, BR Synthesis and receptor binding of enantiomeric N-substituted cis-N-[2-(3,4-dichlorophenyl)ethyl]-2-(1-pyrrolidinyl)cyclohexylamines as high-affinity sigma receptor ligands. J Med Chem 34:3058-65 (1991)  
Target
Name:
Sigma non-opioid intracellular receptor 1
Synonyms:
Aging-associated gene 8 protein SGMR1_HUMAN SIGMAR1 SR31747-binding protein Sigma 1-type opioid receptor Sigma1R | hSigmaR1
Type:
Enzyme Catalytic Domain
Mol. Mass.:
25124.85
Organism:
Homo sapiens (Human)
Description:
Q99720
Residue:
223
  
Inhibitor
Name:
BDBM50007315
Synonyms:
CHEMBL103065 | [2-(3,4-Dichloro-phenyl)-ethyl]-ethyl-(2-pyrrolidin-1-yl-cyclohexyl)-amine
Type:
Small organic molecule
Emp. Form.:
C20H30Cl2N2
Mol. Mass.:
369.372
SMILES:
CCN(CCc1ccc(Cl)c(Cl)c1)[C@H]1CCCC[C@H]1N1CCCC1
: