Target
Sigma non-opioid intracellular receptor 1
Ligand
BDBM50003749
Substrate
Meas. Tech.
ChEBML_201279
Ki
65±n/a nM
Citation
 Radesca, LBowen, WDDi Paolo, Lde Costa, BR Synthesis and receptor binding of enantiomeric N-substituted cis-N-[2-(3,4-dichlorophenyl)ethyl]-2-(1-pyrrolidinyl)cyclohexylamines as high-affinity sigma receptor ligands. J Med Chem 34:3058-65 (1991)  
Target
Name:
Sigma non-opioid intracellular receptor 1
Synonyms:
Aging-associated gene 8 protein SGMR1_HUMAN SIGMAR1 SR31747-binding protein Sigma 1-type opioid receptor Sigma1R | hSigmaR1
Type:
Enzyme Catalytic Domain
Mol. Mass.:
25124.85
Organism:
Homo sapiens (Human)
Description:
Q99720
Residue:
223
  
Inhibitor
Name:
BDBM50003749
Synonyms:
(2S)-N-[2-(3,4-dichlorophenyl)ethyl]-N-methyl-2-(pyrrolidin-1-yl)cyclohexan-1-amine ChEMBL_172996 | [2-(3,4-Dichloro-phenyl)-ethyl]-methyl-(2-pyrrolidin-1-yl-cyclohexyl)-amine
Type:
Small organic molecule
Emp. Form.:
C19H28Cl2N2
Mol. Mass.:
355.345
SMILES:
CN(CCc1ccc(Cl)c(Cl)c1)[C@H]1CCCC[C@@H]1N1CCCC1
: