Target
Glutamate receptor ionotropic, NMDA 2C
Ligand
BDBM50007396
Substrate
Meas. Tech.
ChEBML_154220
IC50
>10000±n/a nM
Citation
 Glennon, RAYousif, MYIsmaiel, AMel-Ashmawy, MBHerndon, JLFischer, JBServer, ACHowie, KJ Novel 1-phenylpiperazine and 4-phenylpiperidine derivatives as high-affinity sigma ligands. J Med Chem 34:3360-5 (1992)  
Target
Name:
Glutamate receptor ionotropic, NMDA 2C
Synonyms:
Glutamate NMDA receptor; Grin1/Grin2c Grin2c NMDE3_RAT
Type:
Protein
Mol. Mass.:
135305.94
Organism:
Rattus norvegicus (Rat)
Description:
Q00961
Residue:
1237
  
Inhibitor
Name:
BDBM50007396
Synonyms:
4-Phenyl-1-(5-phenyl-pentyl)-piperidine | CHEMBL112474
Type:
Small organic molecule
Emp. Form.:
C22H29N
Mol. Mass.:
307.4724
SMILES:
C(CCN1CCC(CC1)c1ccccc1)CCc1ccccc1
: