Target
D(2) dopamine receptor
Ligand
BDBM50007393
Substrate
Meas. Tech.
ChEBML_58713
IC50
335±n/a nM
Citation
 Glennon, RAYousif, MYIsmaiel, AMel-Ashmawy, MBHerndon, JLFischer, JBServer, ACHowie, KJ Novel 1-phenylpiperazine and 4-phenylpiperidine derivatives as high-affinity sigma ligands. J Med Chem 34:3360-5 (1992)  
Target
Name:
D(2) dopamine receptor
Synonyms:
DOPAMINE D2 DOPAMINE D2 Short Dopamine D2 receptor Drd2
Type:
G Protein-Coupled Receptor (GPCR)
Mol. Mass.:
50931.60
Organism:
Rattus norvegicus (rat)
Description:
P61169
Residue:
444
  
Inhibitor
Name:
BDBM50007393
Synonyms:
4-Phenyl-1-(3-phenyl-propyl)-piperidine | CHEMBL112124
Type:
Small organic molecule
Emp. Form.:
C20H25N
Mol. Mass.:
279.4192
SMILES:
C(CN1CCC(CC1)c1ccccc1)Cc1ccccc1
: