Target
Sigma non-opioid intracellular receptor 1
Ligand
BDBM50007410
Substrate
Meas. Tech.
ChEBML_201731
Ki
2.9±n/a nM
Citation
 Glennon, RAYousif, MYIsmaiel, AMel-Ashmawy, MBHerndon, JLFischer, JBServer, ACHowie, KJ Novel 1-phenylpiperazine and 4-phenylpiperidine derivatives as high-affinity sigma ligands. J Med Chem 34:3360-5 (1992)  
Target
Name:
Sigma non-opioid intracellular receptor 1
Synonyms:
Aging-associated gene 8 protein SGMR1_HUMAN SIGMAR1 SR31747-binding protein Sigma 1-type opioid receptor Sigma1R | hSigmaR1
Type:
Enzyme Catalytic Domain
Mol. Mass.:
25124.85
Organism:
Homo sapiens (Human)
Description:
Q99720
Residue:
223
  
Inhibitor
Name:
BDBM50007410
Synonyms:
1-(4-Chloro-phenyl)-4-(3-phenyl-propyl)-piperazine | CHEMBL112125
Type:
Small organic molecule
Emp. Form.:
C19H23ClN2
Mol. Mass.:
314.852
SMILES:
Clc1ccc(cc1)N1CCN(CCCc2ccccc2)CC1
: