Target
Histamine H1 receptor
Ligand
BDBM22868
Substrate
Meas. Tech.
ChEBML_84706
Ki
3.9±n/a nM
Citation
 Piwinski, JJWong, JKGreen, MJGanguly, AKBillah, MMWest, REKreutner, W Dual antagonists of platelet activating factor and histamine. Identification of structural requirements for dual activity of N-Acyl-4-(5,6-dihydro-11H-benzo [5,6]cyclohepta-[1,2-b]pyridin-11-ylidene)piperidines. J Med Chem 34:457-61 (1991)  
Target
Name:
Histamine H1 receptor
Synonyms:
HISTAMINE H1 Hrh1
Type:
Enzyme Catalytic Domain
Mol. Mass.:
55716.35
Organism:
RAT
Description:
HISTAMINE H1 HRH1 RAT::P31390
Residue:
486
  
Inhibitor
Name:
BDBM22868
Synonyms:
11-(1-methylpiperidin-4-ylidene)-6,11-dihydro-5H-benzo[5,6]cyclohepta[1,2-b]pyridine Azatadine | CHEMBL946
Type:
Small organic molecule
Emp. Form.:
C20H22N2
Mol. Mass.:
290.4021
SMILES:
[#6]-[#7]-1-[#6]-[#6]\[#6](-[#6]-[#6]-1)=[#6]-1/c2ccccc2-[#6]-[#6]-c2cccnc-12
: