Target
Platelet-activating factor receptor
Ligand
BDBM50007475
Substrate
Meas. Tech.
ChEBML_86450
IC50
8700.0±n/a nM
Citation
 Piwinski, JJWong, JKGreen, MJGanguly, AKBillah, MMWest, REKreutner, W Dual antagonists of platelet activating factor and histamine. Identification of structural requirements for dual activity of N-Acyl-4-(5,6-dihydro-11H-benzo [5,6]cyclohepta-[1,2-b]pyridin-11-ylidene)piperidines. J Med Chem 34:457-61 (1991)  
Target
Name:
Platelet-activating factor receptor
Synonyms:
PAF Platelet activating factor PAFR PTAFR_HUMAN Platelet-activating factor receptor
Type:
Enzyme Catalytic Domain
Mol. Mass.:
39219.60
Organism:
Homo sapiens (Human)
Description:
PAF Platelet activating factor PTAFR HUMAN::P25105
Residue:
342
  
Inhibitor
Name:
BDBM50007475
Synonyms:
1-[4-(8-Hydroxy-5,6-dihydro-benzo[5,6]cyclohepta[1,2-b]pyridin-11-ylidene)-piperidin-1-yl]-ethanone | CHEMBL358332
Type:
Small organic molecule
Emp. Form.:
C21H22N2O2
Mol. Mass.:
334.4116
SMILES:
[#6]-[#6](=O)-[#7]-1-[#6]-[#6]\[#6](-[#6]-[#6]-1)=[#6]-1/c2ccc(-[#8])cc2-[#6]-[#6]-c2cccnc-12
: