Target
5-hydroxytryptamine receptor 1A
Ligand
BDBM50007557
Substrate
Meas. Tech.
ChEMBL_837 (CHEMBL615837)
IC50
6.9±n/a nM
Citation
 Lowe, JASeeger, TFNagel, AAHoward, HRSeymour, PAHeym, JHEwing, FENewman, MESchmidt, AWFurman, JS 1-Naphthylpiperazine derivatives as potential atypical antipsychotic agents. J Med Chem 34:1860-6 (1991)  
Target
Name:
5-hydroxytryptamine receptor 1A
Synonyms:
5-HT-1A 5-HT1A 5-hydroxytryptamine receptor 1A (5HT1A) 5ht1a Htr1a Serotonin 1a (5-HT1a) receptor/Adrenergic receptor alpha-1 | Serotonin receptor 1A
Type:
G Protein-Coupled Receptor (GPCR)
Mol. Mass.:
46445.29
Organism:
Rattus norvegicus (rat)
Description:
Binding assays were performed using rat hippocampal membranes.
Residue:
422
  
Inhibitor
Name:
BDBM50007557
Synonyms:
3,3-Dimethyl-5-[2-(4-naphthalen-1-yl-piperazin-1-yl)-ethyl]-1,3-dihydro-indol-2-one | CHEMBL294702
Type:
Small organic molecule
Emp. Form.:
C26H29N3O
Mol. Mass.:
399.528
SMILES:
CC1(C)C(=O)Nc2ccc(CCN3CCN(CC3)c3cccc4ccccc34)cc12
: