Target
D(2) dopamine receptor
Ligand
BDBM50007674
Substrate
Meas. Tech.
ChEBML_61275
IC50
>1000±n/a nM
Citation
 Chenard, BLShalaby, IAKoe, BKRonau, RTButler, TWProchniak, MASchmidt, AWFox, CB Separation of alpha 1 adrenergic and N-methyl-D-aspartate antagonist activity in a series of ifenprodil compounds. J Med Chem 34:3085-90 (1991)  
Target
Name:
D(2) dopamine receptor
Synonyms:
D(2) dopamine receptor DOPAMINE D2 Long DRD2 Dopamine D2 receptor Dopamine D2 receptor (D2R) Dopamine2-like | d2
Type:
Cell-surface receptors
Mol. Mass.:
50647.10
Organism:
Homo sapiens (Human)
Description:
P14416
Residue:
443
  
Inhibitor
Name:
BDBM50007674
Synonyms:
(+)-erythro 4-[2-(4-Benzyl-piperidin-1-yl)-1-hydroxy-propyl]-phenol 4-[(1R,2S)-2-(4-Benzyl-piperidin-1-yl)-1-hydroxy-propyl]-phenol 4-[2-(4-Benzyl-piperidin-1-yl)-1-hydroxy-propyl]-phenol Ifenprodil | Ifenprodil,(+/-)
Type:
Small organic molecule
Emp. Form.:
C21H27NO2
Mol. Mass.:
325.4446
SMILES:
C[C@@H]([C@H](O)c1ccc(O)cc1)N1CCC(Cc2ccccc2)CC1
: