Target
Alpha-1A/Alpha-1B/Alpha-1D adrenergic receptor
Ligand
BDBM50007677
Substrate
Meas. Tech.
ChEMBL_33974 (CHEMBL645239)
IC50
2300±n/a nM
Citation
 Chenard, BLShalaby, IAKoe, BKRonau, RTButler, TWProchniak, MASchmidt, AWFox, CB Separation of alpha 1 adrenergic and N-methyl-D-aspartate antagonist activity in a series of ifenprodil compounds. J Med Chem 34:3085-90 (1991)  
Target
Name:
Alpha-1A/Alpha-1B/Alpha-1D adrenergic receptor
Synonyms:
Adrenergic receptor alpha-1 alpha-1 Adrenergic Receptor
Type:
Mol. Mass.:
Description:
ASSAY_ID of EBI is 303470
Components:
This complex has 3 components.
Component 1
Name:
Alpha-1B adrenergic receptor
Synonyms:
ADA1B_RAT Alpha 1B-adrenoceptor Alpha adrenergic receptor 1A and 1B Alpha-1Adrenoceptor Alpha-1B adrenoreceptor | adrenergic Alpha1B
Type:
G Protein-Coupled Receptor (GPCR)
Mol. Mass.:
56606.71
Organism:
Rattus norvegicus (rat)
Description:
Receptor binding assays were performed using rat cortical membranes.
Residue:
515
  
Component 2
Name:
Alpha-1A adrenergic receptor
Synonyms:
ADA1A_RAT Adra1c Alpha-1A adrenoceptor Alpha-1C adrenergic receptor | adrenergic Alpha1A
Type:
Protein
Mol. Mass.:
51620.15
Organism:
Rattus norvegicus (Rat)
Description:
P43140
Residue:
466
  
Component 3
Name:
Alpha-1D adrenergic receptor
Synonyms:
ADA1D_RAT Adra1d Alpha-1D adrenergic receptor | Serotonin 1a (5-HT1a) receptor/Adrenergic receptor alpha-1
Type:
Protein
Mol. Mass.:
59375.97
Organism:
Rattus norvegicus (Rat)
Description:
P23944
Residue:
561
  
Inhibitor
Name:
BDBM50007677
Synonyms:
(+)-threo 4-[2-(4-Benzyl-piperidin-1-yl)-1-hydroxy-propyl]-phenol 4-[(1S,2S)-2-(4-Benzyl-piperidin-1-yl)-1-hydroxy-propyl]-phenol CHEMBL319706 | Ifenprodil
Type:
Small organic molecule
Emp. Form.:
C21H27NO2
Mol. Mass.:
325.4446
SMILES:
C[C@@H]([C@@H](O)c1ccc(O)cc1)N1CCC(Cc2ccccc2)CC1
: