Target
D(2) dopamine receptor
Ligand
BDBM50007688
Substrate
Meas. Tech.
ChEBML_58551
IC50
111±n/a nM
Citation
 Cipollina, JARuediger, EHNew, JSWire, MEShepherd, TASmith, DWYevich, JP Synthesis and biological activity of the putative metabolites of the atypical antipsychotic agent tiospirone. J Med Chem 34:3316-28 (1991)  
Target
Name:
D(2) dopamine receptor
Synonyms:
DOPAMINE D2 DOPAMINE D2 Short Dopamine D2 receptor Drd2
Type:
G Protein-Coupled Receptor (GPCR)
Mol. Mass.:
50931.60
Organism:
Rattus norvegicus (rat)
Description:
P61169
Residue:
444
  
Inhibitor
Name:
BDBM50007688
Synonyms:
8-[4-(4-Benzo[d]isothiazol-3-yl-piperazin-1-yl)-3-hydroxy-butyl]-8-aza-spiro[4.5]decane-7,9-dione (HCl) | CHEMBL326775
Type:
Small organic molecule
Emp. Form.:
C24H32N4O3S
Mol. Mass.:
456.601
SMILES:
OC(CCN1C(=O)CC2(CCCC2)CC1=O)CN1CCN(CC1)c1nsc2ccccc12
: