Target
5-hydroxytryptamine receptor 2A
Ligand
BDBM50007694
Substrate
Meas. Tech.
ChEBML_2203
IC50
2.9±n/a nM
Citation
 Cipollina, JARuediger, EHNew, JSWire, MEShepherd, TASmith, DWYevich, JP Synthesis and biological activity of the putative metabolites of the atypical antipsychotic agent tiospirone. J Med Chem 34:3316-28 (1991)  
Target
Name:
5-hydroxytryptamine receptor 2A
Synonyms:
5-HT-2A 5-HT2A 5-hydroxytryptamine receptor 2A (5HT2A) Htr2 Serotonin Receptor 2A
Type:
G Protein-Coupled Receptor (GPCR)
Mol. Mass.:
52852.05
Organism:
Rattus norvegicus (rat)
Description:
Rat cortex membranes 5-HT2A receptors.
Residue:
471
  
Inhibitor
Name:
BDBM50007694
Synonyms:
8-[4-(4-Benzo[d]isothiazol-3-yl-piperazin-1-yl)-butyl]-8-aza-spiro[4.5]decane-2,7,9-trione (HCl) | CHEMBL115367
Type:
Small organic molecule
Emp. Form.:
C24H30N4O3S
Mol. Mass.:
454.585
SMILES:
O=C1CCC2(C1)CC(=O)N(CCCCN1CCN(CC1)c1nsc3ccccc13)C(=O)C2
: