Target
5-hydroxytryptamine receptor 2A
Ligand
BDBM50007690
Substrate
Meas. Tech.
ChEBML_2203
IC50
1.1±n/a nM
Citation
 Cipollina, JARuediger, EHNew, JSWire, MEShepherd, TASmith, DWYevich, JP Synthesis and biological activity of the putative metabolites of the atypical antipsychotic agent tiospirone. J Med Chem 34:3316-28 (1991)  
Target
Name:
5-hydroxytryptamine receptor 2A
Synonyms:
5-HT-2A 5-HT2A 5-hydroxytryptamine receptor 2A (5HT2A) Htr2 Serotonin Receptor 2A
Type:
G Protein-Coupled Receptor (GPCR)
Mol. Mass.:
52852.05
Organism:
Rattus norvegicus (rat)
Description:
Rat cortex membranes 5-HT2A receptors.
Residue:
471
  
Inhibitor
Name:
BDBM50007690
Synonyms:
8-[4-(4-Benzo[d]isothiazol-3-yl-piperazin-1-yl)-butyl]-6-hydroxy-8-aza-spiro[4.5]decane-7,9-dione | CHEMBL115486
Type:
Small organic molecule
Emp. Form.:
C24H32N4O3S
Mol. Mass.:
456.601
SMILES:
OC1C(=O)N(CCCCN2CCN(CC2)c2nsc3ccccc23)C(=O)CC11CCCC1
: