Target
5-hydroxytryptamine receptor 2A
Ligand
BDBM50007691
Substrate
Meas. Tech.
ChEBML_2203
IC50
4.5±n/a nM
Citation
 Cipollina, JARuediger, EHNew, JSWire, MEShepherd, TASmith, DWYevich, JP Synthesis and biological activity of the putative metabolites of the atypical antipsychotic agent tiospirone. J Med Chem 34:3316-28 (1991)  
Target
Name:
5-hydroxytryptamine receptor 2A
Synonyms:
5-HT-2A 5-HT2A 5-hydroxytryptamine receptor 2A (5HT2A) Htr2 Serotonin Receptor 2A
Type:
G Protein-Coupled Receptor (GPCR)
Mol. Mass.:
52852.05
Organism:
Rattus norvegicus (rat)
Description:
Rat cortex membranes 5-HT2A receptors.
Residue:
471
  
Inhibitor
Name:
BDBM50007691
Synonyms:
3-Oxo-2-oxa-spiro[4.4]nonane-1-carboxylic acid [4-(4-benzo[d]isothiazol-3-yl-piperazin-1-yl)-butyl]-amide (1.4HCl) | CHEMBL321591
Type:
Small organic molecule
Emp. Form.:
C24H32N4O3S
Mol. Mass.:
456.601
SMILES:
O=C(NCCCCN1CCN(CC1)c1nsc2ccccc12)C1OC(=O)CC11CCCC1
: