Target
Substance-P receptor
Ligand
BDBM50007823
Substrate
Meas. Tech.
ChEBML_141637
EC50
188±n/a nM
Citation
 Ward, PEwan, GBJordan, CCIreland, SJHagan, RMBrown, JR Potent and highly selective neurokinin antagonists. J Med Chem 33:1848-51 (1990)  
Target
Name:
Substance-P receptor
Synonyms:
NK1R_CAVPO Neurokinin NK1 TACR1
Type:
Enzyme Catalytic Domain
Mol. Mass.:
46261.42
Organism:
GUINEA PIG
Description:
Neurokinin NK1 TACR1 GUINEA PIG::P30547
Residue:
407
  
Inhibitor
Name:
BDBM50007823
Synonyms:
1-{2-[2-(4-Amino-butyrylamino)-3-phenyl-propionylamino]-3-phenyl-propionyl}-pyrrolidine-2-carboxylic acid [1-(1-carbamoyl-3-methylsulfanyl-propylcarbamoyl)-3-methyl-butyl]-amide | CHEMBL2372953
Type:
Small organic molecule
Emp. Form.:
C38H55N7O6S
Mol. Mass.:
737.952
SMILES:
CSCC[C@@H](NC(=O)[C@H](CC(C)C)NC(=O)[C@@H]1CCCN1C(=O)[C@H](Cc1ccccc1)NC(=O)[C@H](Cc1ccccc1)NC(=O)CCCN)C(N)=O
: