Target
Substance-K receptor
Ligand
BDBM50007822
Substrate
Meas. Tech.
ChEMBL_141646 (CHEMBL749547)
EC50
>100.0±n/a nM
Citation
 Ward, PEwan, GBJordan, CCIreland, SJHagan, RMBrown, JR Potent and highly selective neurokinin antagonists. J Med Chem 33:1848-51 (1990)  
Target
Name:
Substance-K receptor
Synonyms:
NK-2 receptor NK2R_RAT Neurokinin A receptor SKR Tac2r Tacr2
Type:
Enzyme Catalytic Domain
Mol. Mass.:
43868.63
Organism:
Rattus norvegicus (Rat)
Description:
Neurokinin NK2 TACR2 Murine::P16610
Residue:
390
  
Inhibitor
Name:
BDBM50007822
Synonyms:
2-(2-{2-[2-(4-Amino-butyrylamino)-3-phenyl-propionylamino]-3-phenyl-propionylamino}-acetylamino)-4-methyl-pentanoic acid [1-carbamoyl-2-(1H-indol-3-yl)-ethyl]-amide | CHEMBL2372954
Type:
Small organic molecule
Emp. Form.:
C41H52N8O6
Mol. Mass.:
752.9016
SMILES:
CC(C)C[C@H](NC(=O)CNC(=O)[C@H](Cc1ccccc1)NC(=O)[C@H](Cc1ccccc1)NC(=O)CCCN)C(=O)N[C@@H](Cc1c[nH]c2ccccc12)C(N)=O
: