Target
Adenosine receptor A2a/A2b
Ligand
BDBM50004587
Substrate
Meas. Tech.
ChEMBL_30561 (CHEMBL649873)
Ki
>5000±n/a nM
Citation
 Katsushima, TNieves, LWells, JN Structure-activity relationships of 8-cycloalkyl-1,3-dipropylxanthines as antagonists of adenosine receptors. J Med Chem 33:1906-10 (1990)  
Target
Name:
Adenosine receptor A2a/A2b
Synonyms:
Adenosine A2 receptor
Type:
Mol. Mass.:
Description:
ASSAY_ID of ChEMBL is 30560
Components:
This complex has 2 components.
Component 1
Name:
Adenosine receptor A2b
Synonyms:
AA2BR_RAT Adora2b
Type:
PROTEIN
Mol. Mass.:
36378.84
Organism:
Rattus norvegicus
Description:
ChEMBL_32934
Residue:
332
  
Component 2
Name:
Adenosine receptor A2a
Synonyms:
AA2AR_RAT Adenosine A2 receptor Adenosine Receptors A2a (A2a) Adenosine receptors A2a Rat striatal adenosine A2a receptor
Type:
G Protein-Coupled Receptor (GPCR)
Mol. Mass.:
45015.65
Organism:
Rattus norvegicus (rat)
Description:
Rat A2A receptors expressed in CHO cells.
Residue:
410
  
Inhibitor
Name:
BDBM50004587
Synonyms:
8-Adamantan-1-yl-1,3-dipropyl-3,7-dihydro-purine-2,6-dione | CHEMBL418101
Type:
Small organic molecule
Emp. Form.:
C21H30N4O2
Mol. Mass.:
370.4885
SMILES:
CCCn1c2nc([nH]c2c(=O)n(CCC)c1=O)C12CC3CC(CC(C3)C1)C2
: