Target
Cholecystokinin receptor type A
Ligand
BDBM50007932
Substrate
Meas. Tech.
ChEBML_49721
Ki
660±n/a nM
Citation
 Gonzalez-Muniz, RBergeron, FMarseigne, IDurieux, CRoques, BP Boc-Trp-Orn(Z)-Asp-NH2 and derivatives: a new family of CCK antagonists. J Med Chem 33:3199-204 (1991)  
Target
Name:
Cholecystokinin receptor type A
Synonyms:
CCK-A receptor CCK1-R CCKAR_CAVPO Cholecystokinin receptor type A | Cholecystokinin-1 receptor
Type:
Mol. Mass.:
48229.77
Organism:
Cavia porcellus
Description:
Residue:
430
  
Inhibitor
Name:
BDBM50007932
Synonyms:
Boc-Tyr(SO3H)NLe-Gly-Trp-Orn(Z)-Asp-NH2 | CHEMBL2370441
Type:
Small organic molecule
Emp. Form.:
C56H76N10O16S
Mol. Mass.:
1177.325
SMILES:
CCCC[C@H](NC(=O)[C@H](Cc1ccc(cc1)S(O)(=O)=O)NC(=O)OC(C)(C)C)C(=O)NCC(=O)N[C@@H](Cc1c[nH]c2ccccc12)C(=O)N[C@@H](CCCNC(=O)OC(C)(C)C)C(=O)N[C@@H](CC(O)=O)C(=O)N[C@@H](Cc1ccccc1)C(N)=O
: