Target
Gonadotropin-releasing hormone receptor
Ligand
BDBM50007953
Substrate
Meas. Tech.
ChEBML_71439
Kd
0.080000±n/a nM
Citation
 Theobald, PPorter, JRivier, CCorrigan, AHook, WSiraganian, RPerrin, MVale, WRivier, J Novel gonadotropin-releasing hormone antagonists: peptides incorporating modified N omega-cyanoguanidino moieties. J Med Chem 34:2395-402 (1991)  
Target
Name:
Gonadotropin-releasing hormone receptor
Synonyms:
GNRHR_RAT GnRH-R | Gnrhr
Type:
PROTEIN
Mol. Mass.:
37767.60
Organism:
Rattus norvegicus
Description:
ChEMBL_1335047
Residue:
327
  
Inhibitor
Name:
BDBM50007953
Synonyms:
CHEMBL414113 | pGlu-His-DPal-Ser-Tyr-DPal-Leu-ILys-Pro-DAla-NH2
Type:
Small organic molecule
Emp. Form.:
C62H86N16O13
Mol. Mass.:
1263.4456
SMILES:
CC(C)C[C@H](NC(=O)[C@@H](Cc1cccnc1)NC(=O)[C@H](Cc1ccc(O)cc1)NC(=O)[C@H](CO)NC(=O)[C@@H](Cc1cccnc1)NC(=O)[C@H](Cc1cnc[nH]1)NC(=O)[C@@H]1CCC(=O)N1)C(=O)N[C@@H](CCCCNC(C)C)C(=O)N1CCC[C@H]1C(=O)N[C@H](C)C(N)=O
: