Target
Substance-P receptor
Ligand
BDBM50007963
Substrate
Meas. Tech.
ChEBML_141661
EC50
2.2±n/a nM
Citation
 Roubini, ELaufer, RGilon, CSelinger, ZRoques, BPChorev, M Pseudopeptide analogues of substance P and leucine enkephalinamide containing the psi (CH2O) modification: synthesis and biological activity. J Med Chem 34:2430-8 (1991)  
Target
Name:
Substance-P receptor
Synonyms:
NK1R_CAVPO Neurokinin NK1 TACR1
Type:
Enzyme Catalytic Domain
Mol. Mass.:
46261.42
Organism:
GUINEA PIG
Description:
Neurokinin NK1 TACR1 GUINEA PIG::P30547
Residue:
407
  
Inhibitor
Name:
BDBM50007963
Synonyms:
CHEMBL441061 | pGlu6-Phe-Phe-Gly-Leu-Met-NH2
Type:
Small organic molecule
Emp. Form.:
C36H49N7O7S
Mol. Mass.:
723.882
SMILES:
CSCC[C@H](NC(=O)[C@H](CC(C)C)NC(=O)CNC(=O)[C@H](Cc1ccccc1)NC(=O)[C@H](Cc1ccccc1)NC(=O)[C@@H]1CCC(=O)N1)C(N)=O
: