Target
Gastrin/cholecystokinin type B receptor
Ligand
BDBM50007922
Substrate
Meas. Tech.
ChEMBL_47818 (CHEMBL662560)
IC50
1200±n/a nM
Citation
 Shiosaki, KLin, CWKopecka, HTufano, MDBianchi, BRMiller, TRWitte, DGNadzan, AM Boc-CCK-4 derivatives containing side-chain ureas as potent and selective CCK-a receptor agonists. J Med Chem 34:2837-42 (1991)  
Target
Name:
Gastrin/cholecystokinin type B receptor
Synonyms:
CCK-2 receptor CCK-BR CCKRB Cholecystokinin receptor GASR_HUMAN | Gastrin/cholecystokinin type B receptor
Type:
G Protein-Coupled Receptor (GPCR)
Mol. Mass.:
48445.79
Organism:
Homo sapiens (Human)
Description:
Stable expression of human CCK-2 receptors in HEK 293 cells.
Residue:
447
  
Inhibitor
Name:
BDBM50007922
Synonyms:
3-{1-[1-aminobutyl oxycarbonylamino-2-(1H-3-indolyl)ethylcarboxamido]-5-formamido-para-methyl phenylaminopentylcarboxamido}-3-(1-carbamoyl-2-phenylethylcarbamoyl)propanoic acid | CHEMBL262767
Type:
Small organic molecule
Emp. Form.:
C43H54N8O9
Mol. Mass.:
826.9371
SMILES:
Cc1ccc(NC(=O)NCCCC[C@H](NC(=O)[C@H](Cc2c[nH]c3ccccc23)NC(=O)OC(C)(C)C)C(=O)N[C@@H](CC(O)=O)C(=O)N[C@@H](Cc2ccccc2)C(N)=O)cc1
: