Target
Reverse transcriptase/RNaseH
Ligand
BDBM50008017
Substrate
Meas. Tech.
ChEBML_196945
IC50
90300±n/a nM
Citation
 Goudgaon, NMSchinazi, RF Activity of acyclic 6-(phenylselenenyl)pyrimidine nucleosides against human immunodeficiency viruses in primary lymphocytes. J Med Chem 34:3305-9 (1991)  
Target
Name:
Reverse transcriptase/RNaseH
Synonyms:
HIV-1 Reverse Transcriptase RNase H Reverse transcriptase/RNaseH
Type:
PROTEIN
Mol. Mass.:
65229.15
Organism:
Human immunodeficiency virus 1
Description:
ChEMBL_1473730
Residue:
566
  
Inhibitor
Name:
BDBM50008017
Synonyms:
1-(2-Hydroxy-ethoxymethyl)-5-methyl-6-phenylselanyl-1H-pyrimidine-2,4-dione | CHEMBL112732
Type:
Small organic molecule
Emp. Form.:
C14H16N2O4Se
Mol. Mass.:
355.25
SMILES:
Cc1c([Se]c2ccccc2)n(COCCO)c(=O)[nH]c1=O
: