Target
Muscarinic acetylcholine receptor M1
Ligand
BDBM50008065
Substrate
Meas. Tech.
ChEMBL_138694 (CHEMBL747661)
IC50
110000±n/a nM
Citation
 Shapiro, GFloersheim, PBoelsterli, JAmstutz, RBolliger, GGammenthaler, HGmelin, GSupavilai, PWalkinshaw, M Muscarinic activity of the thiolactone, lactam, lactol, and thiolactol analogues of pilocarpine and a hypothetical model for the binding of agonists to the m1 receptor. J Med Chem 35:15-27 (1992)  
Target
Name:
Muscarinic acetylcholine receptor M1
Synonyms:
ACM1_RAT Chrm-1 cholinergic receptor, muscarinic 1
Type:
Enzyme Catalytic Domain
Mol. Mass.:
51390.46
Organism:
RAT
Description:
P08482
Residue:
460
  
Inhibitor
Name:
BDBM50008065
Synonyms:
3-Ethyl-4-(3-methyl-3H-imidazol-4-ylmethyl)-tetrahydro-furan-2-ol | CHEMBL316282
Type:
Small organic molecule
Emp. Form.:
C11H18N2O2
Mol. Mass.:
210.2728
SMILES:
CC[C@H]1[C@@H](Cc2cncn2C)COC1O
: