Target
Muscarinic acetylcholine receptor M1
Ligand
BDBM46858
Substrate
Meas. Tech.
ChEBML_138791
IC50
1740±n/a nM
Citation
 Shapiro, GFloersheim, PBoelsterli, JAmstutz, RBolliger, GGammenthaler, HGmelin, GSupavilai, PWalkinshaw, M Muscarinic activity of the thiolactone, lactam, lactol, and thiolactol analogues of pilocarpine and a hypothetical model for the binding of agonists to the m1 receptor. J Med Chem 35:15-27 (1992)  
Target
Name:
Muscarinic acetylcholine receptor M1
Synonyms:
ACM1_RAT Chrm-1 cholinergic receptor, muscarinic 1
Type:
Enzyme Catalytic Domain
Mol. Mass.:
51390.46
Organism:
RAT
Description:
P08482
Residue:
460
  
Inhibitor
Name:
BDBM46858
Synonyms:
1-methyl-3,6-dihydro-2H-pyridine-5-carboxylic acid methyl ester;hydrobromide ARECOLINE HYDROBROMIDE SMR000058258 cid_9301 | methyl 1-methyl-3,6-dihydro-2H-pyridine-5-carboxylate;hydrobromide
Type:
Small organic molecule
Emp. Form.:
C8H13NO2
Mol. Mass.:
155.1943
SMILES:
COC(=O)C1=CCCN(C)C1
: