Target
Transient receptor potential cation channel subfamily V member 1
Ligand
BDBM50256581
Substrate
Meas. Tech.
ChEBML_1688140
Ki
0.300000±n/a nM
Citation
 Lee, SKang, DWRyu, HKim, CAnn, JLee, HKim, EHong, SChoi, SBlumberg, PMFrank-Foltyn, RBahrenberg, GStockhausen, HChristoph, TLee, J t-Butyl pyridine and phenyl C-region analogues of 2-(3-fluoro-4-methylsulfonylaminophenyl)propanamides as potent TRPV1 antagonists. Bioorg Med Chem 25:2451-2462 (2017)  
Target
Name:
Transient receptor potential cation channel subfamily V member 1
Synonyms:
Capsaicin receptor Osm-9-like TRP channel 1 TRPV1_HUMAN Transient receptor potential cation channel subfamily V member 1 (TRPV1) Transient receptor potential cation channel subfamily V member 1(TRPV1) Vanilloid VR1 Vanilloid receptor 1 Vanilloid receptor 1 (VRI/TRPV1)
Type:
Protein
Mol. Mass.:
94960.75
Organism:
Homo sapiens (Human)
Description:
Q8NER1
Residue:
839
  
Inhibitor
Name:
BDBM50256581
Synonyms:
CHEMBL4078240
Type:
Small organic molecule
Emp. Form.:
C26H29F2N3O3S
Mol. Mass.:
501.589
SMILES:
CC(C(=O)NCc1ccc(nc1-c1ccc(F)cc1)C(C)(C)C)c1ccc(NS(C)(=O)=O)c(F)c1
: