Target
Tyrosine-protein phosphatase non-receptor type 1
Ligand
BDBM50256837
Substrate
Meas. Tech.
ChEBML_1688460
IC50
870±n/a nM
Citation
 Yang, FXie, FZhang, YXia, YLiu, WJiang, FLam, CQiao, YXie, DLi, JFu, L Y-shaped bis-arylethenesulfonic acid esters: Potential potent and membrane permeable protein tyrosine phosphatase 1B inhibitors. Bioorg Med Chem Lett 27:2166-2170 (2017)  
Target
Name:
Tyrosine-protein phosphatase non-receptor type 1
Synonyms:
PTN1_HUMAN PTPN1 Protein tyrosine phosphatase-1B (PTP1B) Protein-tyrosine phosphatase 1B (PTP1B) Tyrosine-protein phosphatase non-receptor type 1 (PTP1B)
Type:
Protein phosphatase
Mol. Mass.:
49963.76
Organism:
Homo sapiens (Human)
Description:
Human recombinant GST-fusion PTP1B (1-435).
Residue:
435
  
Inhibitor
Name:
BDBM50256837
Synonyms:
CHEMBL4095504
Type:
Small organic molecule
Emp. Form.:
C42H38F3NO10S2
Mol. Mass.:
837.877
SMILES:
CCOS(=O)(=O)\C=C\c1ccc(OCc2ccc(COc3ccc(\C=C\S(=O)(=O)OCC)cc3)c(c2)C(=O)Nc2ccc(Oc3ccccc3C(F)(F)F)cc2)cc1
: