Target
C5a anaphylatoxin chemotactic receptor 1
Ligand
BDBM50008229
Substrate
Meas. Tech.
ChEBML_41471
Ki
600000±n/a nM
Citation
 Kawai, MQuincy, DALane, BMollison, KWOr, YSLuly, JRCarter, GW Structure-function studies in a series of carboxyl-terminal octapeptide analogues of anaphylatoxin C5a. J Med Chem 35:220-3 (1992)  
Target
Name:
C5a anaphylatoxin chemotactic receptor 1
Synonyms:
C5AR C5AR1_HUMAN C5a anaphylatoxin chemotactic receptor C5a-R | CD_antigen=CD88
Type:
Enzyme
Mol. Mass.:
39347.68
Organism:
Homo sapiens (Human)
Description:
P21730
Residue:
350
  
Inhibitor
Name:
BDBM50008229
Synonyms:
2-[2-(2-{2-[2-(2-{2-[2-Acetylamino-3-(3H-imidazol-4-yl)-propionylamino]-6-amino-hexanoylamino}-3-carboxy-propionylamino)-3-cyclohexyl-propionylamino]-3-cyclohexyl-propionylamino}-pentanoylamino)-propionylamino]-5-guanidino-pentanoic acid | CHEMBL3350712
Type:
Small organic molecule
Emp. Form.:
C51H86N14O12
Mol. Mass.:
1087.3151
SMILES:
CC(C)C[C@H](NC(=O)[C@@H](CC1CCCCC1)NC(=O)[C@@H](CC1CCCCC1)NC(=O)[C@H](CC(O)=O)NC(=O)C(CCCCN)NC(=O)[C@H](Cc1c[nH]cn1)NC(C)=O)C(=O)N[C@H](C)C(=O)N[C@@H](CCCN=C(N)N)C(O)=O
: