Target
Adenosylhomocysteinase
Ligand
BDBM50008288
Substrate
Meas. Tech.
ChEBML_196872
IC50
721±n/a nM
Citation
 Shuto, SObara, TToriya, MHosoya, MSnoeck, RAndrei, GBalzarini, JDe Clercq, E New neplanocin analogues. 1. Synthesis of 6'-modified neplanocin A derivatives as broad-spectrum antiviral agents. J Med Chem 35:324-31 (1992)  
Target
Name:
Adenosylhomocysteinase
Synonyms:
AHCY SAHH | SAHH_HUMAN
Type:
PROTEIN
Mol. Mass.:
47714.06
Organism:
Homo sapiens (Human)
Description:
ChEMBL_1507791
Residue:
432
  
Inhibitor
Name:
BDBM50008288
Synonyms:
(1S,2R,5R)-5-(6-Amino-purin-9-yl)-3-((R)-1-hydroxy-ethyl)-cyclopent-3-ene-1,2-diol CHEMBL327105
Type:
Small organic molecule
Emp. Form.:
C12H15N5O3
Mol. Mass.:
277.2792
SMILES:
C[C@@H](O)C1=C[C@H]([C@H](O)[C@@H]1O)n1cnc2c(N)ncnc12
: